BDBM50367654 CHEMBL1237336
SMILES Fc1ccc(cc1)[C@H]1C[C@H](N2CCNCC2)c2ccccc12
InChI Key InChIKey=IEXNAGAJXPUXLE-MOPGFXCFSA-N
Data  6 IC50
  Tab Delimited (TSV)   2D SDfile   Computed 3D by Vconf -m prep SDfile
Find this compound or compounds like it in BindingDB:
Activity Spreadsheet -- Enzyme Inhibition Constant Data from BindingDB
Found 6 hits for monomerid = 50367654
TargetSodium-dependent serotonin transporter(Rattus norvegicus (rat))
H. Lundbeck
Curated by ChEMBL
LigandPNGBDBM50367654(CHEMBL1237336)
Affinity DataIC50:  400nM. Assay description: In vitro inhibition of [3H]5-HT transporter uptake in rat brain synaptosomes
In DepthDetails ArticlePubMed
TargetSodium-dependent dopamine transporter(Rattus norvegicus (rat))
H. Lundbeck
Curated by ChEMBL
LigandPNGBDBM50367654(CHEMBL1237336)
Affinity DataIC50:  220nM. Assay description: In vitro inhibition of [3H]dopamine uptake in rat brain synaptosomes
In DepthDetails ArticlePubMed
TargetSerotonin 2 (5-HT2) receptor(RAT)
H. Lundbeck
Curated by ChEMBL
LigandPNGBDBM50367654(CHEMBL1237336)
Affinity DataIC50:  180nM. Assay description: Inhibition of [3H]spiperone binding to 5-hydroxytryptamine 2 receptor from rat cortical membranes
In DepthDetails ArticlePubMed
TargetTransporter(Rattus norvegicus)
H. Lundbeck
Curated by ChEMBL
LigandPNGBDBM50367654(CHEMBL1237336)
Affinity DataIC50:  140nM. Assay description: In vitro inhibition of [3H]norepinephrine uptake in rat brain synaptosomes
In DepthDetails ArticlePubMed
TargetAlpha-1A/Alpha-1B/Alpha-1D adrenergic receptor(Rattus norvegicus (rat))
H. Lundbeck
Curated by ChEMBL
LigandPNGBDBM50367654(CHEMBL1237336)
Affinity DataIC50:  540nM. Assay description: Inhibition of [3H]prazosin binding to alpha-1 adrenergic receptor from rat cortical membranes
In DepthDetails ArticlePubMed
TargetD(2) dopamine receptor(Rattus norvegicus (rat))
H. Lundbeck
Curated by ChEMBL
LigandPNGBDBM50367654(CHEMBL1237336)
Affinity DataIC50:  8.50E+3nM. Assay description: Inhibition of [3H]spiperone binding to Dopamine receptor D2 from rat striatal membranes
In DepthDetails ArticlePubMed