BDBM50367655 CHEMBL1237343
SMILES Fc1ccc(cc1)C1CC(N2CCN(CCN3CCCC3=O)CC2)c2cc(F)ccc12
InChI Key InChIKey=GUAKGWYDXPBRKT-UHFFFAOYSA-N
Data  3 IC50
  Tab Delimited (TSV)   2D SDfile   Computed 3D by Vconf -m prep SDfile
Find this compound or compounds like it in BindingDB:
Activity Spreadsheet -- Enzyme Inhibition Constant Data from BindingDB
Found 3 hits for monomerid = 50367655
TargetD(2) dopamine receptor(Rattus norvegicus (rat))
H. Lundbeck
Curated by ChEMBL
LigandPNGBDBM50367655(CHEMBL1237343)
Affinity DataIC50:  85nM. Assay description: Inhibition of [3H]spiperone binding to Dopamine receptor D2 from rat striatal membranes
In DepthDetails ArticlePubMed
TargetAlpha-1A/Alpha-1B/Alpha-1D adrenergic receptor(Rattus norvegicus (rat))
H. Lundbeck
Curated by ChEMBL
LigandPNGBDBM50367655(CHEMBL1237343)
Affinity DataIC50:  36nM. Assay description: Inhibition of [3H]prazosin binding to alpha-1 adrenergic receptor from rat cortical membranes
In DepthDetails ArticlePubMed
TargetSerotonin 2 (5-HT2) receptor(RAT)
H. Lundbeck
Curated by ChEMBL
LigandPNGBDBM50367655(CHEMBL1237343)
Affinity DataIC50:  12nM. Assay description: Inhibition of [3H]spiperone binding to 5-hydroxytryptamine 2 receptor from rat cortical membranes
In DepthDetails ArticlePubMed