BDBM50367740 CHEMBL1907766
SMILES CC[C@H](NC(=O)CC)c1nc2c(cccc2c(O)c1C(=O)Nc1nccs1)C(F)(F)F
InChI Key InChIKey=FLKLCVZAZBAKOJ-LBPRGKRZSA-N
Data  2 IC50
  Tab Delimited (TSV)   2D SDfile   Computed 3D by Vconf -m prep SDfile
Find this compound or compounds like it in BindingDB:
Activity Spreadsheet -- Enzyme Inhibition Constant Data from BindingDB
Found 2 hits for monomerid = 50367740
TargetProstaglandin G/H synthase 1/2(Bos taurus)
Centre De Recherches Roussel-Uclaf
Curated by ChEMBL
LigandPNGBDBM50367740(CHEMBL1907766)
Affinity DataIC50:  400nM. Assay description: Inhibition of bovine Prostaglandin G/H synthase after oral administration
In DepthDetails ArticlePubMed
TargetPolyunsaturated fatty acid 5-lipoxygenase(Rattus norvegicus)
Centre De Recherches Roussel-Uclaf
Curated by ChEMBL
LigandPNGBDBM50367740(CHEMBL1907766)
Affinity DataIC50:  2.00E+3nM. Assay description: Inhibition of 5-lipoxygenase from rat peritoneal neutrophils after oral administration
In DepthDetails ArticlePubMed