BDBM50367807 CHEMBL1202678
SMILES C(CCN1CCCC1)COc1ccc(\C=C\c2nc3ccccc3o2)cc1
InChI Key InChIKey=RNWBAZINVYSMKW-SDNWHVSQSA-N
Data  2 IC50
  Tab Delimited (TSV)   2D SDfile   Computed 3D by Vconf -m prep SDfile
Find this compound or compounds like it in BindingDB:
Activity Spreadsheet -- Enzyme Inhibition Constant Data from BindingDB
Found 2 hits for monomerid = 50367807
TargetPotassium-transporting ATPase alpha chain 1/subunit beta(Homo sapiens (Human))
Ortho Pharmaceutical
Curated by ChEMBL
LigandPNGBDBM50367807(CHEMBL1202678)
Affinity DataIC50:  240nM. Assay description: Antisecretory activity evaluated by the inhibition of 14C -AP uptake in isolated rabbit parietal cells stimulated by dibutyryl cyclic adenosine 3', 5...
In DepthDetails ArticlePubMed
TargetPotassium-transporting ATPase alpha chain 1/subunit beta(Homo sapiens (Human))
Ortho Pharmaceutical
Curated by ChEMBL
LigandPNGBDBM50367807(CHEMBL1202678)
Affinity DataIC50:  170nM. Assay description: Antisecretory activity evaluated by the inhibition of 14C -AP uptake in isolated rabbit parietal cells stimulated by exogenous histamine
In DepthDetails ArticlePubMed