BDBM50367872 CHEMBL603402
SMILES COc1ccc(NC(=S)NCCNC(=O)Cc2ccc(NC(=O)Cc3ccc(Nc4ncnc5n(cnc45)C4O[C@H](CO)[C@@H](O)[C@H]4O)cc3)cc2)cc1
InChI Key InChIKey=OGMFWNIJXJDAHK-IFEJDVHESA-N
Data  1 KI
  Tab Delimited (TSV)   2D SDfile   Computed 3D by Vconf -m prep SDfile
Find this compound or compounds like it in BindingDB:
Activity Spreadsheet -- Enzyme Inhibition Constant Data from BindingDB
Found 1 hit for monomerid = 50367872
TargetAdenosine receptor A1(Rattus norvegicus (rat))
Niddk
Curated by ChEMBL
LigandPNGBDBM50367872(CHEMBL603402)
Affinity DataKi:  8.5nM. Assay description: Affinity for adenosine A1 receptor using [3H]-N6 -(phenylisopropyl)-adenosine (R)-[3H]-PIA in rat brain.
In DepthDetails ArticlePubMed