BDBM50368250 CHEMBL605254
SMILES Nc1nc(OCCCC2CCCCC2)nc2n(cnc12)C1O[C@@H](CO)[C@H](O)[C@@H]1O
InChI Key InChIKey=AXQPZHZXHWEFFP-QAYVNIIMSA-N
Data  1 EC50
  Tab Delimited (TSV)   2D SDfile   Computed 3D by Vconf -m prep SDfile
Find this compound or compounds like it in BindingDB:
Activity Spreadsheet -- Enzyme Inhibition Constant Data from BindingDB
Found 1 hit for monomerid = 50368250
TargetAdenosine receptor A1(GUINEA PIG)
University Of South Florida
Curated by ChEMBL
LigandPNGBDBM50368250(CHEMBL605254)
Affinity DataEC50:  3.72E+3nM. Assay description: Prolongation of the stimulus-QRS interval by 50% of the maximum response at the adenosine A1 receptor in langendorff guinea pig heart preparationChecked by Author
In DepthDetails ArticlePubMed