BDBM50368374 CHEMBL1202930
SMILES CN(C)CCCN1C(SCC1=O)c1ccncc1
InChI Key InChIKey=IBIYXTHKRMDTTC-UHFFFAOYSA-N
Data  1 IC50
  Tab Delimited (TSV)   2D SDfile   Computed 3D by Vconf -m prep SDfile
Find this compound or compounds like it in BindingDB:
Activity Spreadsheet -- Enzyme Inhibition Constant Data from BindingDB
Found 1 hit for monomerid = 50368374
TargetHistamine H1 receptor(Cavia porcellus (domestic guinea pig))
Universit£
Curated by ChEMBL
LigandPNGBDBM50368374(CHEMBL1202930)
Affinity DataIC50: >1.00E+5nM. Assay description: Compound was tested in vitro for histamine H1-antagonist activity against histamine-induced contractions on isolated guinea pig ileum
In DepthDetails ArticlePubMed