BDBM50368442 CHEMBL1203297
SMILES CS(=O)(=O)Nc1ccc2OC3(CCN(CCc4ccc(cc4)C#N)CC3)CC(=O)c2c1
InChI Key InChIKey=SSMILKNOIRFJFA-UHFFFAOYSA-N
Data  1 IC50
  Tab Delimited (TSV)   2D SDfile   Computed 3D by Vconf -m prep SDfile
Find this compound or compounds like it in BindingDB:
Activity Spreadsheet -- Enzyme Inhibition Constant Data from BindingDB
Found 1 hit for monomerid = 50368442
TargetAlpha-1A adrenergic receptor(CALF)
Merck Research Laboratories
Curated by ChEMBL
LigandPNGBDBM50368442(CHEMBL1203297)
Affinity DataIC50:  1.00E+3nM. Assay description: Compound was evaluated for binding affinity at bovine brain Alpha-1 adrenergic receptor in a filtration-based assay using [3H]prazosin as the radioli...
In DepthDetails ArticlePubMed