BDBM50368532 CHEMBL1203375
SMILES Fc1ccc(cc1)C(=O)C1CCN(CCCC(=O)c2ccccc2)CC1
InChI Key InChIKey=KBXPOTBYUXVVJY-UHFFFAOYSA-N
Data  2 KI
  Tab Delimited (TSV)   2D SDfile   Computed 3D by Vconf -m prep SDfile
Find this compound or compounds like it in BindingDB:
Activity Spreadsheet -- Enzyme Inhibition Constant Data from BindingDB
Found 2 hits for monomerid = 50368532
TargetSerotonin 2 (5-HT2) receptor(RAT)
Virginia Commonwealth University
Curated by ChEMBL
LigandPNGBDBM50368532(CHEMBL1203375)
Affinity DataKi:  6.5nM. Assay description: Binding affinity against 5-hydroxytryptamine 2 receptor in rat using [3H]ketanserin as radioligand
In DepthDetails ArticlePubMed
Target5-hydroxytryptamine receptor 2C(Rattus norvegicus (Rat))
Virginia Commonwealth University
Curated by ChEMBL
LigandPNGBDBM50368532(CHEMBL1203375)
Affinity DataKi:  350nM. Assay description: Binding affinity against 5-hydroxytryptamine 1C receptor in rat using [3H]mesulergine as radioligand
In DepthDetails ArticlePubMed