BDBM50368720 CHEMBL1203158
SMILES O=C(NC1CCCCC1)[C@H]1Cc2c(CN1)sc1ccccc21
InChI Key InChIKey=PXRKGMDZAKKKKW-OAHLLOKOSA-N
Data  1 IC50
  Tab Delimited (TSV)   2D SDfile   Computed 3D by Vconf -m prep SDfile
Find this compound or compounds like it in BindingDB:
Activity Spreadsheet -- Enzyme Inhibition Constant Data from BindingDB
Found 1 hit for monomerid = 50368720
Target5-hydroxytryptamine receptor 1A(Rattus norvegicus (rat))
Asahi Chemical Industry
Curated by ChEMBL
LigandPNGBDBM50368720(CHEMBL1203158)
Affinity DataIC50:  27nM. Assay description: Binding affinity by measuring displacement of [3H]-8-OH-DPAT from 5-hydroxytryptamine 1A receptor in rat hippocampus
In DepthDetails ArticlePubMed