BDBM50368726 CHEMBL1203156
SMILES O=C(OC1CCCCCC1)[C@H]1Cc2c(CN1)sc1ccccc21
InChI Key InChIKey=HFYFUAKNFWJYTM-MRXNPFEDSA-N
Data  1 IC50
  Tab Delimited (TSV)   2D SDfile   Computed 3D by Vconf -m prep SDfile
Find this compound or compounds like it in BindingDB:
Activity Spreadsheet -- Enzyme Inhibition Constant Data from BindingDB
Found 1 hit for monomerid = 50368726
Target5-hydroxytryptamine receptor 1A(Rattus norvegicus (rat))
Asahi Chemical Industry
Curated by ChEMBL
LigandPNGBDBM50368726(CHEMBL1203156)
Affinity DataIC50:  55nM. Assay description: Binding affinity by measuring displacement of [3H]-8-OH-DPAT from 5-hydroxytryptamine 1A receptor in rat hippocampus
In DepthDetails ArticlePubMed