BDBM50368788 CHEMBL1791112
SMILES CCOC(=O)CC(O)[C@H](CC(C)C)NC(=O)[C@@H](NC(=O)[C@H](CC1CCCCC1)NC(=O)OC(C)(C)C)[C@H](C)CC
InChI Key InChIKey=FTHJSTXANKAZRW-BMRDAKNSSA-N
Data  3 IC50
  Tab Delimited (TSV)   2D SDfile   Computed 3D by Vconf -m prep SDfile
Find this compound or compounds like it in BindingDB:
Activity Spreadsheet -- Enzyme Inhibition Constant Data from BindingDB
Found 3 hits for monomerid = 50368788
TargetCathepsin D(Bos taurus)
Abbott Laboratories
Curated by ChEMBL
LigandPNGBDBM50368788(CHEMBL1791112)
Affinity DataIC50:  58nM. Assay description: Inhibition of conversion of hemoglobin by commercially purchased bovine spleen cathepsin D.
In DepthDetails ArticlePubMed
TargetRenin(Homo sapiens (Human))
Abbott Laboratories
Curated by ChEMBL
LigandPNGBDBM50368788(CHEMBL1791112)
Affinity DataIC50: >1.00E+4nMpH: 6.0Assay Description:In vitro inhibition of partially purified human renin at pH 6.0.
In DepthDetails ArticlePubMed
TargetEndothelin-converting enzyme 1(Rattus norvegicus (Rat))
Abbott Laboratories
Curated by ChEMBL
LigandPNGBDBM50368788(CHEMBL1791112)
Affinity DataIC50:  16nM. Assay description: Inhibition of conversion of big endothelial-1 (Big ET-1) to ET-1 by endothelin converting enzyme(ECE) in rat lung membrane.
In DepthDetails ArticlePubMed