BDBM50368886 CHEMBL1793955
SMILES CC[C@H](C)[C@@H]1NC(=O)CC2(CCCCC2)SSC[C@H](NC(=O)[C@H](CC(N)=O)NC(=O)[C@H](CCC(N)=O)NC(=O)[C@H](Cc2ccccc2)NC1=O)C(=O)N(C)CC(=O)N[C@@H](CCCNC(N)=N)C(=O)NCC(N)=O
InChI Key InChIKey=FLYYNGHZBWJEHS-DHTODDSISA-N
Data  2 Kd
  Tab Delimited (TSV)   2D SDfile   Computed 3D by Vconf -m prep SDfile
Find this compound or compounds like it in BindingDB:
Activity Spreadsheet -- Enzyme Inhibition Constant Data from BindingDB
Found 2 hits for monomerid = 50368886
TargetVasopressin V2 receptor(BOVINE)
Max-Planck-Institut F£R Biophysik
Curated by ChEMBL
LigandPNGBDBM50368886(CHEMBL1793955)
Affinity DataKd:  182nM. Assay description: Inhibition of radioligand [3H]AVP binding to V2 receptor in bovine kidney inner medulla membrane
In DepthDetails ArticlePubMed
TargetOxytocin receptor(Homo sapiens (Human))
Max-Planck-Institut F£R Biophysik
Curated by ChEMBL
LigandPNGBDBM50368886(CHEMBL1793955)
Affinity DataKd:  265nM. Assay description: Inhibition of radioligand [3H]OT binding to oxytocin receptor (OT) in guinea pig myometrium membrane
In DepthDetails ArticlePubMed