BDBM50369350 CHEMBL606280
SMILES NC(=O)c1coc(c1)C1O[C@H](COP(O)(=O)OP(O)(=O)OC[C@H]2OC([C@H](O)[C@@H]2O)n2cnc3c(N)ncnc23)[C@@H](O)[C@H]1O
InChI Key InChIKey=ZDPNWKLPQYGRKA-ACPBJEGFSA-N
Data  4 KI
  Tab Delimited (TSV)   2D SDfile   Computed 3D by Vconf -m prep SDfile
Find this compound or compounds like it in BindingDB:
Activity Spreadsheet -- Enzyme Inhibition Constant Data from BindingDB
Found 4 hits for monomerid = 50369350
TargetInosine-5'-monophosphate dehydrogenase 1(Homo sapiens (Human))
Universit£
Curated by ChEMBL
LigandPNGBDBM50369350(CHEMBL606280)
Affinity DataKi:  3.80E+4nM. Assay description: The compound was tested for the inhibition towards IMP(Inosine 5'-monophosphate) substrate of Inosine-5'-monophosphate dehydrogenase 1
In DepthDetails ArticlePubMed
TargetInosine-5'-monophosphate dehydrogenase 2(Homo sapiens (Human))
Universit£
Curated by ChEMBL
LigandPNGBDBM50369350(CHEMBL606280)
Affinity DataKi:  5.79E+4nM. Assay description: The compound was tested for the inhibition towards IMP(Inosine 5'-monophosphate) substrate of Inosine-5'-monophosphate dehydrogenase 2
In DepthDetails ArticlePubMed
TargetInosine-5'-monophosphate dehydrogenase 2(Homo sapiens (Human))
Universit£
Curated by ChEMBL
LigandPNGBDBM50369350(CHEMBL606280)
Affinity DataKi:  9.91E+4nM. Assay description: The compound was tested for the inhibition towards NMD (Nicotinamide adenine dinucleotide) substrate of Inosine-5'-monophosphate dehydrogenase 2
In DepthDetails ArticlePubMed
TargetInosine-5'-monophosphate dehydrogenase 1(Homo sapiens (Human))
Universit£
Curated by ChEMBL
LigandPNGBDBM50369350(CHEMBL606280)
Affinity DataKi:  1.35E+5nM. Assay description: The compound was tested for the inhibition towards NMD (Nicotinamide adenine dinucleotide) substrate of Inosine-5'-monophosphate dehydrogenase 1
In DepthDetails ArticlePubMed