BDBM50369393 CHEMBL608312
SMILES Nc1ncnc2n(cnc12)C1O[C@H](C#CI)[C@@H](O)[C@H]1O
InChI Key InChIKey=SLDOTDVQNFUCHQ-YNJARDAQSA-N
Data  1 KI
  Tab Delimited (TSV)   2D SDfile   Computed 3D by Vconf -m prep SDfile
Find this compound or compounds like it in BindingDB:
Activity Spreadsheet -- Enzyme Inhibition Constant Data from BindingDB
Found 1 hit for monomerid = 50369393
TargetAdenosylhomocysteinase(Homo sapiens (Human))
Brigham Young University
Curated by ChEMBL
LigandPNGBDBM50369393(CHEMBL608312)
Affinity DataKi:  1.10E+3nM. Assay description: Kinetic constant calculated from the pseudo-first-order rate constant(k app) for S-adenosyl-homocysteine hydrolase inactivation
In DepthDetails ArticlePubMed