BDBM50369445 CHEMBL607771
SMILES CCCCCCSc1nc(N)c2ncn(C3O[C@H](COP([O-])([O-])=S)[C@@H](O)[C@H]3O)c2n1
InChI Key InChIKey=DPAGUSSBIWVODX-FJFSNTMWSA-L
Data  1 EC50
  Tab Delimited (TSV)   2D SDfile   Computed 3D by Vconf -m prep SDfile
Find this compound or compounds like it in BindingDB:
Activity Spreadsheet -- Enzyme Inhibition Constant Data from BindingDB
Found 1 hit for monomerid = 50369445
TargetP2Y purinoceptor 1(Meleagris gallopavo)
Bar-Ilan University
Curated by ChEMBL
LigandPNGBDBM50369445(CHEMBL607771)
Affinity DataEC50:  2.79E+3nM. Assay description: Agonistic activity for P2Y purinoceptor 1 of turkey erythrocyte membranes
In DepthDetails ArticlePubMed