BDBM50369598 CHEMBL118624
SMILES CCCCC(=O)Nc1ccccc1SSc1ccccc1NC(=O)CCCC
InChI Key InChIKey=YOEDOJCAWALZTA-UHFFFAOYSA-N
Data  1 IC50
  Tab Delimited (TSV)   2D SDfile   Computed 3D by Vconf -m prep SDfile
Find this compound or compounds like it in BindingDB:
Activity Spreadsheet -- Enzyme Inhibition Constant Data from BindingDB
Found 1 hit for monomerid = 50369598
TargetCholesteryl ester transfer protein(Homo sapiens (Human))
Research Triangle Institute
Curated by ChEMBL
LigandPNGBDBM50369598(CHEMBL118624)
Affinity DataIC50:  2.50E+4nM. Assay description: In vitro concentration required to inhibit 50% of cholesteryl ester transfer protein mediated cholesteryl ester transfer from HDL to VLDL and LDL in ...
In DepthDetails ArticlePubMed