BDBM50369615 CHEMBL118867
SMILES CCCCCC1(CCCCC1)C(=O)Nc1ccccc1S
InChI Key InChIKey=JUPWIWFSEBMYBY-UHFFFAOYSA-N
Data  1 IC50
  Tab Delimited (TSV)   2D SDfile   Computed 3D by Vconf -m prep SDfile
Find this compound or compounds like it in BindingDB:
Activity Spreadsheet -- Enzyme Inhibition Constant Data from BindingDB
Found 1 hit for monomerid = 50369615
TargetCholesteryl ester transfer protein(Homo sapiens (Human))
Research Triangle Institute
Curated by ChEMBL
LigandPNGBDBM50369615(CHEMBL118867)
Affinity DataIC50:  7.00E+3nM. Assay description: In vitro concentration required to inhibit 50% of cholesteryl ester transfer protein mediated cholesteryl ester transfer from HDL to VLDL and LDL in ...
In DepthDetails ArticlePubMed