BDBM50369986 CHEMBL4171956
SMILES CN1CCN([C@H](Cc2ccccc2)C1)C(=O)c1ccc(cc1)S(N)(=O)=O
InChI Key InChIKey=JJZIVRAYCISPKI-QGZVFWFLSA-N
Data  4 KI
  Tab Delimited (TSV)   2D SDfile   Computed 3D by Vconf -m prep SDfile
Find this compound or compounds like it in BindingDB:
Activity Spreadsheet -- Enzyme Inhibition Constant Data from BindingDB
Found 4 hits for monomerid = 50369986
TargetCarbonic anhydrase 4(Homo sapiens (Human))
University Of Florence
Curated by ChEMBL
LigandPNGBDBM50369986(CHEMBL4171956)
Affinity DataKi:  3.60nM. Assay description: Inhibition of human membrane-anchored carbonic anhydrase 4 assessed as inhibition of CO2 hydration preincubated for 15 mins prior to testing by pheno...
In DepthDetails ArticlePubMed
TargetCarbonic anhydrase 2(Homo sapiens (Human))
University Of Florence
Curated by ChEMBL
LigandPNGBDBM50369986(CHEMBL4171956)
Affinity DataKi:  7.60nM. Assay description: Inhibition of human cytosolic carbonic anhydrase 2 assessed as inhibition of CO2 hydration preincubated for 15 mins prior to testing by phenol red ba...
In DepthDetails ArticlePubMed
TargetCarbonic anhydrase 1(Homo sapiens (Human))
University Of Florence
Curated by ChEMBL
LigandPNGBDBM50369986(CHEMBL4171956)
Affinity DataKi:  38nM. Assay description: Inhibition of human cytosolic carbonic anhydrase 1 assessed as inhibition of CO2 hydration preincubated for 15 mins prior to testing by phenol red ba...
In DepthDetails ArticlePubMed
TargetCarbonic anhydrase 9(Homo sapiens (Human))
University Of Florence
Curated by ChEMBL
LigandPNGBDBM50369986(CHEMBL4171956)
Affinity DataKi:  1.21E+3nM. Assay description: Inhibition of human transmembrane tumor-associated carbonic anhydrase 9 assessed as inhibition of CO2 hydration preincubated for 15 mins prior to tes...
In DepthDetails ArticlePubMed