BDBM50370043 CHEMBL1744263
SMILES CCc1cscc1C(C)c1cnc[nH]1
InChI Key InChIKey=HFUHOULGXNYWIO-UHFFFAOYSA-N
Data  1 KI
  Tab Delimited (TSV)   2D SDfile   Computed 3D by Vconf -m prep SDfile
Find this compound or compounds like it in BindingDB:
Activity Spreadsheet -- Enzyme Inhibition Constant Data from BindingDB
Found 1 hit for monomerid = 50370043
TargetAlpha-1D adrenergic receptor(Homo sapiens (Human))
The R. W. Johnson Pharmaceutical Research Institute
Curated by ChEMBL
LigandPNGBDBM50370043(CHEMBL1744263)
Affinity DataKi:  0.280nM. Assay description: In vitro binding affinity against alpha-2D adrenergic receptor of male Wistar rat
In DepthDetails ArticlePubMed