BDBM50370216 CHEMBL1744084
SMILES CCCN1c2ccccc2C(=N[C@@H](NC(=O)Nc2ccc(cc2)N2CCN(CC2)c2ccncc2)C1=O)C1CCCCC1
InChI Key InChIKey=QLODTSDJKHVWDH-YTTGMZPUSA-N
Data  1 KI  2 IC50
  Tab Delimited (TSV)   2D SDfile   Computed 3D by Vconf -m prep SDfile
Find this compound or compounds like it in BindingDB:
Activity Spreadsheet -- Enzyme Inhibition Constant Data from BindingDB
Found 3 hits for monomerid = 50370216
TargetB1 bradykinin receptor(Homo sapiens (Human))
Merck Research Laboratories
Curated by ChEMBL
LigandPNGBDBM50370216(CHEMBL1744084)
Affinity DataKi:  1.33nM. Assay description: Inhibition of human bradykinin B1 receptor
In DepthDetails ArticlePubMed
TargetB1 bradykinin receptor(RAT)
Merck Research Laboratories
Curated by ChEMBL
LigandPNGBDBM50370216(CHEMBL1744084)
Affinity DataIC50:  24.2nM. Assay description: Compound was tested for inhibition against rat Bradykinin receptor B1 using FLIPR assay
In DepthDetails ArticlePubMed
TargetB1 bradykinin receptor(Homo sapiens (Human))
Merck Research Laboratories
Curated by ChEMBL
LigandPNGBDBM50370216(CHEMBL1744084)
Affinity DataIC50:  8nM. Assay description: Compound was tested for inhibition against human bradykinin B1 receptor using FLIPR assay
In DepthDetails ArticlePubMed