BDBM50370752 CHEMBL1791384
SMILES [#6]-[#6]-[#6@H](-[#6])-[#6@H](-[#7]-[#6](=O)-[#6@H](-[#6]-c1ccc(-[#8])cc1)-[#7]-[#6](=O)-[#6@@H]-1-[#6]-[#6]-[#6]-[#7]-1-[#6](=O)-[#6@H](-[#6]-[#6]-[#6]-[#7]-[#6](-[#7])=[#7])-[#7]-[#6](=O)-[#6](-[#6]-[#6]-[#6]\[#7]=[#6](\[#7])-[#7])-[#7]-[#6](=O)-[#6]-[#7]-[#6](=O)-[#6](-[#6]-[#7]-[#6]-[#6]-[#7])-[#6]-[#7]-[#6]-[#6]-[#7])-[#6](=O)-[#7]-[#6@@H](-[#6]-[#6](-[#6])-[#6])-[#6](-[#8])=O
InChI Key InChIKey=HMOSHXNVAPZVAT-PTGNYJEQSA-N
Data  2 IC50
  Tab Delimited (TSV)   2D SDfile   Computed 3D by Vconf -m prep SDfile
Find this compound or compounds like it in BindingDB:
Activity Spreadsheet -- Enzyme Inhibition Constant Data from BindingDB
Found 2 hits for monomerid = 50370752
TargetNeurotensin receptor type 1(Homo sapiens (Human))
National Center For Scientific Research Demokritos
Curated by ChEMBL
LigandPNGBDBM50370752(CHEMBL1791384)
Affinity DataIC50:  0.140nM. Assay description: Displacement of [125I]Tyr3-NT from human NTS1R expressed in WiDr cells
In DepthDetails ArticlePubMed
TargetNeurotensin receptor type 1(Homo sapiens (Human))
National Center For Scientific Research Demokritos
Curated by ChEMBL
LigandPNGBDBM50370752(CHEMBL1791384)
Affinity DataIC50:  0.320nM. Assay description: Displacement of [125I]Tyr3-NT from human NTS1R expressed in HT29 cells
In DepthDetails ArticlePubMed