BDBM50370769 CHEMBL218200
SMILES OC(=O)CC(NC(=O)c1cc(cc(c1)[N+]([O-])=O)C(=O)Nc1ccc2CCNCc2c1)c1ccccc1
InChI Key InChIKey=JCOVTLVBRHTAIH-UHFFFAOYSA-N
Data  1 IC50
  Tab Delimited (TSV)   2D SDfile   Computed 3D by Vconf -m prep SDfile
Find this compound or compounds like it in BindingDB:
Activity Spreadsheet -- Enzyme Inhibition Constant Data from BindingDB
Found 1 hit for monomerid = 50370769
TargetIntegrin alpha-2/beta-3(Homo sapiens (Human))
A.V. Bogatsky Physico-Chemical Institute Of The National Academy Of Sciences Of Ukraine
Curated by ChEMBL
LigandPNGBDBM50370769(CHEMBL218200)
Affinity DataIC50:  8nM. Assay description: Displacement of FITC-Fg from integrin alpha2beta3 receptor expressed in human activated platelets
In DepthDetails ArticlePubMed