BDBM50370849 CHEMBL385118
SMILES NNC(=O)CNC(=O)Cc1cccc2ccccc12
InChI Key InChIKey=STSAYTMCURXUDT-UHFFFAOYSA-N
Data  1 IC50
  Tab Delimited (TSV)   2D SDfile   Computed 3D by Vconf -m prep SDfile
Find this compound or compounds like it in BindingDB:
Activity Spreadsheet -- Enzyme Inhibition Constant Data from BindingDB
Found 1 hit for monomerid = 50370849
TargetCystathionine beta-lyase MetC(Escherichia coli K-12)
Mcmaster University
Curated by ChEMBL
LigandPNGBDBM50370849(CHEMBL385118)
Affinity DataIC50:  5.00E+5nM. Assay description: Inhibition of Escherichia coli CBL
In DepthDetails ArticlePubMed