BDBM50370953 CHEMBL388357
SMILES COc1cc(CCNc2ncc(C(N)=O)c(Nc3cccc(C)c3)n2)ccc1O
InChI Key InChIKey=MIJBQCMTXLNOTK-UHFFFAOYSA-N
Data  1 IC50
  Tab Delimited (TSV)   2D SDfile   Computed 3D by Vconf -m prep SDfile
Find this compound or compounds like it in BindingDB:
Activity Spreadsheet -- Enzyme Inhibition Constant Data from BindingDB
Found 1 hit for monomerid = 50370953
TargetSignal transducer and activator of transcription 6(Homo sapiens (Human))
Astellas Pharm
Curated by ChEMBL
LigandPNGBDBM50370953(CHEMBL388357)
Affinity DataIC50:  660nM. Assay description: Inhibition of STAT6 in human IL4-stimulated FW4 cells
In DepthDetails ArticlePubMed