BDBM50370957 CHEMBL389452
SMILES CCNC(=O)c1cnc(NCCc2ccc(O)cc2)nc1Nc1cccc(C)c1
InChI Key InChIKey=JZYLVDXYVRFLBF-UHFFFAOYSA-N
Data  1 IC50
  Tab Delimited (TSV)   2D SDfile   Computed 3D by Vconf -m prep SDfile
Find this compound or compounds like it in BindingDB:
Activity Spreadsheet -- Enzyme Inhibition Constant Data from BindingDB
Found 1 hit for monomerid = 50370957
TargetSignal transducer and activator of transcription 6(Homo sapiens (Human))
Astellas Pharm
Curated by ChEMBL
LigandPNGBDBM50370957(CHEMBL389452)
Affinity DataIC50:  380nM. Assay description: Inhibition of STAT6 in human IL4-stimulated FW4 cells
In DepthDetails ArticlePubMed