BDBM50371121 CHEMBL440951
SMILES OC(=O)c1ccc(cc1)-n1nc(c2CCCCc12)C(F)(F)F
InChI Key InChIKey=HDAMKETZPRJTAX-UHFFFAOYSA-N
Data  1 KI
  Tab Delimited (TSV)   2D SDfile   Computed 3D by Vconf -m prep SDfile
Find this compound or compounds like it in BindingDB:
Activity Spreadsheet -- Enzyme Inhibition Constant Data from BindingDB
Found 1 hit for monomerid = 50371121
TargetLow molecular weight phosphotyrosine protein phosphatase(Bos taurus)
Institute For Research In Biomedicine (Irb)
Curated by ChEMBL
LigandPNGBDBM50371121(CHEMBL440951)
Affinity DataKi: >1.00E+6nM. Assay description: Inhibition of bovine low molecular weight PTP expressed in Escherichia coli BL21(D3) cells
In DepthDetails ArticlePubMed