BDBM50371164 CHEMBL413980
SMILES OC(=O)CC1=COc2ccccc2O1
InChI Key InChIKey=TWBYZJKGHFJGLC-UHFFFAOYSA-N
Data  1 IC50
  Tab Delimited (TSV)   2D SDfile   Computed 3D by Vconf -m prep SDfile
Find this compound or compounds like it in BindingDB:
Activity Spreadsheet -- Enzyme Inhibition Constant Data from BindingDB
Found 1 hit for monomerid = 50371164
TargetDehydrogenase/reductase SDR family member 9(Rattus norvegicus)
Universitat De Barcelona
Curated by ChEMBL
LigandPNGBDBM50371164(CHEMBL413980)
Affinity DataIC50:  1.00E+5nM. Assay description: Inhibition of rat liver 3-alpha-HSD assessed as 5-beta-dihydrocortisone reduction
In DepthDetails ArticlePubMed