BDBM50371336 CHEMBL257016
SMILES COC(=O)c1c(F)cccc1-c1ccc(CNC(=O)C(O)(C(F)(F)F)C(F)(F)F)c(F)c1
InChI Key InChIKey=WVWYMPHEDAYNLZ-UHFFFAOYSA-N
Data  1 KI
  Tab Delimited (TSV)   2D SDfile   Computed 3D by Vconf -m prep SDfile
Find this compound or compounds like it in BindingDB:
Activity Spreadsheet -- Enzyme Inhibition Constant Data from BindingDB
Found 1 hit for monomerid = 50371336
TargetB1 bradykinin receptor(Homo sapiens (Human))
Merck Research Laboratories
Curated by ChEMBL
LigandPNGBDBM50371336(CHEMBL257016)
Affinity DataKi:  95nM. Assay description: Binding affinity to human bradikinin B1 receptor expressed in CHO cells
In DepthDetails ArticlePubMed