BDBM50371458 CHEMBL539103
SMILES NC1=Nc2cccc(F)c2CN1
InChI Key InChIKey=FQSGTNHRHUTPHN-UHFFFAOYSA-N
Data  1 KI
  Tab Delimited (TSV)   2D SDfile   Computed 3D by Vconf -m prep SDfile
Find this compound or compounds like it in BindingDB:
Activity Spreadsheet -- Enzyme Inhibition Constant Data from BindingDB
Found 1 hit for monomerid = 50371458
Target5-hydroxytryptamine receptor 5A(Homo sapiens (Human))
F. Hoffmann-La Roche
Curated by ChEMBL
LigandPNGBDBM50371458(CHEMBL539103)
Affinity DataKi:  550nM. Assay description: Displacement of [3H]LSD from human recombinant 5HT5A receptor expressed in HEK293-EBNA cells
In DepthDetails ArticlePubMed