BDBM50371586 CHEMBL1162187
SMILES Nc1ncnc2n(cnc12)[C@@H]1O[C@H](COP(O)(O)=O)[C@H]2OC(O[C@@H]12)C#Cc1ccccc1
InChI Key InChIKey=PWCHDKNMCIUSPP-BENWTFJNSA-N
Data  1 IC50
  Tab Delimited (TSV)   2D SDfile   Computed 3D by Vconf -m prep SDfile
Find this compound or compounds like it in BindingDB:
Activity Spreadsheet -- Enzyme Inhibition Constant Data from BindingDB
Found 1 hit for monomerid = 50371586
TargetP2Y purinoceptor 12(Homo sapiens (Human))
Inspire Pharmaceuticals
Curated by ChEMBL
LigandPNGBDBM50371586(CHEMBL1162187)
Affinity DataIC50:  5.71E+4nM. Assay description: Antagonist activity at P2Y12 receptor assessed as inhibition of ADP-induced human platelet aggregation by washed platelet assay
In DepthDetails ArticlePubMed