BDBM50371595 CHEMBL1162160
SMILES Nc1ncnc2n(cnc12)[C@@H]1O[C@H](COP(O)(=O)OP(O)(O)=O)[C@H]2O[C@@H](Cc3ccccc3)O[C@@H]12
InChI Key InChIKey=XXBDXMXSPVACAN-AJKMGBEJSA-N
Data  1 IC50  2 EC50
  Tab Delimited (TSV)   2D SDfile   Computed 3D by Vconf -m prep SDfile
Find this compound or compounds like it in BindingDB:
Activity Spreadsheet -- Enzyme Inhibition Constant Data from BindingDB
Found 3 hits for monomerid = 50371595
TargetP2Y purinoceptor 12(Homo sapiens (Human))
Inspire Pharmaceuticals
Curated by ChEMBL
LigandPNGBDBM50371595(CHEMBL1162160)
Affinity DataIC50:  2.30E+4nM. Assay description: Antagonist activity at P2Y12 receptor assessed as inhibition of ADP-induced human platelet aggregation by washed platelet assay
In DepthDetails ArticlePubMed
TargetP2Y purinoceptor 1(Homo sapiens (Human))
Inspire Pharmaceuticals
Curated by ChEMBL
LigandPNGBDBM50371595(CHEMBL1162160)
Affinity DataEC50:  4.39E+3nM. Assay description: Agonist at human recombinant P2Y1 receptor expressed in human 1321 cells by calcium mobilization assay
In DepthDetails ArticlePubMed
TargetP2Y purinoceptor 2(Homo sapiens (Human))
Inspire Pharmaceuticals
Curated by ChEMBL
LigandPNGBDBM50371595(CHEMBL1162160)
Affinity DataEC50:  1.39E+4nM. Assay description: Agonist activity at P2Y2 receptor expressed in human 1321 cells by calcium mobilization assay
In DepthDetails ArticlePubMed