BDBM50371603 CHEMBL1162165
SMILES OP(=O)(OC[C@H]1O[C@H]([C@@H]2OC(Cc3ccccc3)O[C@H]12)n1ccc(=O)[nH]c1=O)OP(O)(=O)OP(O)(=O)OP(O)(=O)OC[C@@H]1O[C@@H]([C@H]2OC(Cc3ccccc3)O[C@@H]12)n1ccc(=O)[nH]c1=O
InChI Key InChIKey=ISPAXDCHSNKLAS-HWRQHDFZSA-N
Data  1 IC50  1 EC50
  Tab Delimited (TSV)   2D SDfile   Computed 3D by Vconf -m prep SDfile
Find this compound or compounds like it in BindingDB:
Activity Spreadsheet -- Enzyme Inhibition Constant Data from BindingDB
Found 2 hits for monomerid = 50371603
TargetP2Y purinoceptor 2(Homo sapiens (Human))
Inspire Pharmaceuticals
Curated by ChEMBL
LigandPNGBDBM50371603(CHEMBL1162165)
Affinity DataEC50:  1.46E+4nM. Assay description: Agonist activity at P2Y2 receptor expressed in human 1321 cells by calcium mobilization assay
In DepthDetails ArticlePubMed
TargetP2Y purinoceptor 12(Homo sapiens (Human))
Inspire Pharmaceuticals
Curated by ChEMBL
LigandPNGBDBM50371603(CHEMBL1162165)
Affinity DataIC50:  1.82E+3nM. Assay description: Antagonist activity at P2Y12 receptor assessed as inhibition of ADP-induced human platelet aggregation by washed platelet assay
In DepthDetails ArticlePubMed