BDBM50371954 CHEMBL270265
SMILES CCCC1=Nc2[nH]ncc2C(C1c1nnc(C)o1)c1cccc(C#N)c1Br
InChI Key InChIKey=MTNHAYCOSXUGSX-UHFFFAOYSA-N
Data  1 IC50
  Tab Delimited (TSV)   2D SDfile   Computed 3D by Vconf -m prep SDfile
Find this compound or compounds like it in BindingDB:
Activity Spreadsheet -- Enzyme Inhibition Constant Data from BindingDB
Found 1 hit for monomerid = 50371954
TargetGlycogen synthase kinase-3 beta(Homo sapiens (Human))
Korea Institute Of Science And Technology
Curated by ChEMBL
LigandPNGBDBM50371954(CHEMBL270265)
Affinity DataIC50:  0.700nM. Assay description: Inhibition of human GSK3-beta
In DepthDetails ArticlePubMed