BDBM50371983 CHEMBL257744
SMILES COc1c(Cl)ccc2N=C(NCC(F)F)NC(C)c12
InChI Key InChIKey=PZVDYPMNMHJRDU-UHFFFAOYSA-N
Data  5 KI
  Tab Delimited (TSV)   2D SDfile   Computed 3D by Vconf -m prep SDfile
Find this compound or compounds like it in BindingDB:
Activity Spreadsheet -- Enzyme Inhibition Constant Data from BindingDB
Found 5 hits for monomerid = 50371983
Target5-hydroxytryptamine receptor 7(Homo sapiens (Human))
F. Hoffmann-La Roche
Curated by ChEMBL
LigandPNGBDBM50371983(CHEMBL257744)
Affinity DataKi:  17.6nM. Assay description: Binding affinity to human 5HT7 receptor
In DepthDetails ArticlePubMed
Target5-hydroxytryptamine receptor 5A(Homo sapiens (Human))
F. Hoffmann-La Roche
Curated by ChEMBL
LigandPNGBDBM50371983(CHEMBL257744)
Affinity DataKi:  22.2nM. Assay description: Binding affinity to human 5HT5A receptor
In DepthDetails ArticlePubMed
Target5-hydroxytryptamine receptor 2C(Homo sapiens (Human))
F. Hoffmann-La Roche
Curated by ChEMBL
LigandPNGBDBM50371983(CHEMBL257744)
Affinity DataKi:  233nM. Assay description: Binding affinity to 5HT2C receptor
In DepthDetails ArticlePubMed
Target5-hydroxytryptamine receptor 1A(Homo sapiens (Human))
F. Hoffmann-La Roche
Curated by ChEMBL
LigandPNGBDBM50371983(CHEMBL257744)
Affinity DataKi:  348nM. Assay description: Binding affinity to 5HT1A receptor
In DepthDetails ArticlePubMed
Target5-hydroxytryptamine receptor 1D(Homo sapiens (Human))
F. Hoffmann-La Roche
Curated by ChEMBL
LigandPNGBDBM50371983(CHEMBL257744)
Affinity DataKi:  1.81E+3nM. Assay description: Binding affinity to 5HT1D receptor
In DepthDetails ArticlePubMed