BDBM50372049 CHEMBL257255
SMILES CCOc1c2C(=O)N(Cc2c(OCC)c2ncccc12)c1ccc(CS(=O)(=O)NC(=O)Cc2ccccc2OC(F)F)cc1C
InChI Key InChIKey=COUKRPOXCKKQOU-UHFFFAOYSA-N
Data  2 KI
  Tab Delimited (TSV)   2D SDfile   Computed 3D by Vconf -m prep SDfile
Find this compound or compounds like it in BindingDB:
Activity Spreadsheet -- Enzyme Inhibition Constant Data from BindingDB
Found 2 hits for monomerid = 50372049
TargetProstaglandin E2 receptor EP4 subtype(Homo sapiens (Human))
Merck Frosst Centre For Therapeutic Research
Curated by ChEMBL
LigandPNGBDBM50372049(CHEMBL257255)
Affinity DataKi:  0.320nM. Assay description: Binding affinity to human EP4 receptor expressed in HEK293 cells
In DepthDetails ArticlePubMed
TargetProstaglandin E2 receptor EP4 subtype(Homo sapiens (Human))
Merck Frosst Centre For Therapeutic Research
Curated by ChEMBL
LigandPNGBDBM50372049(CHEMBL257255)
Affinity DataKi:  13nM. Assay description: Binding affinity to human EP4 receptor expressed in HEK293 cells in presence of 10% human serum
In DepthDetails ArticlePubMed