BDBM50372167 CHEMBL255526
SMILES Nc1n[nH]c2nccc(-c3ccc(NC(=O)NCC4CCCCC4)cc3)c12
InChI Key InChIKey=RNIRVIXBTXYRQN-UHFFFAOYSA-N
Data  3 IC50
  Tab Delimited (TSV)   2D SDfile   Computed 3D by Vconf -m prep SDfile
Find this compound or compounds like it in BindingDB:
Activity Spreadsheet -- Enzyme Inhibition Constant Data from BindingDB
Found 3 hits for monomerid = 50372167
TargetVascular endothelial growth factor receptor 2(Homo sapiens (Human))
Abbott Laboratories
Curated by ChEMBL
LigandPNGBDBM50372167(CHEMBL255526)
Affinity DataIC50:  64nM. Assay description: Inhibition of KDR by HTRF assay
In DepthDetails ArticlePubMed
TargetVascular endothelial growth factor receptor 2(Homo sapiens (Human))
Abbott Laboratories
Curated by ChEMBL
LigandPNGBDBM50372167(CHEMBL255526)
Affinity DataIC50:  64nM. Assay description: Inhibition of KDR kinase activity (unknown origin)
In DepthDetails Article
TargetVascular endothelial growth factor receptor 2(Homo sapiens (Human))
Abbott Laboratories
Curated by ChEMBL
LigandPNGBDBM50372167(CHEMBL255526)
Affinity DataIC50:  64nM. Assay description: Inhibition of KDR kinase activity (unknown origin)
In DepthDetails Article