BDBM50372179 CHEMBL402066
SMILES Brc1ccc(\C=C2/SC(=S)N([C@@H](Cc3ccccc3)C(=O)OCCOCCOC(=O)[C@H](Cc3ccccc3)N3C(=S)S\C(=C/c4ccc(Br)cc4)C3=O)C2=O)cc1
InChI Key InChIKey=FQWGJMPNGZGJNH-WKAHBFOZSA-N
Data  3 KI
  Tab Delimited (TSV)   2D SDfile   Computed 3D by Vconf -m prep SDfile
Find this compound or compounds like it in BindingDB:
Activity Spreadsheet -- Enzyme Inhibition Constant Data from BindingDB
Found 3 hits for monomerid = 50372179
TargetBcl-2-like protein 2(Homo sapiens (Human))
University Of Minnesota Minneapolis
Curated by ChEMBL
LigandPNGBDBM50372179(CHEMBL402066)
Affinity DataKi:  9.90E+4nM. Assay description: Inhibition of Bak peptide binding to human recombinant Bcl-w
In DepthDetails ArticlePubMed
TargetBcl2-associated agonist of cell death(Homo sapiens (Human))
University Of Minnesota Minneapolis
Curated by ChEMBL
LigandPNGBDBM50372179(CHEMBL402066)
Affinity DataKi:  1.04E+5nM. Assay description: Inhibition of Bak peptide binding to human recombinant Bcl-Xl
In DepthDetails ArticlePubMed
TargetApoptosis regulator Bcl-2(Homo sapiens (Human))
University Of Minnesota Minneapolis
Curated by ChEMBL
LigandPNGBDBM50372179(CHEMBL402066)
Affinity DataKi: >1.00E+6nM. Assay description: Inhibition of Bak peptide binding to human recombinant Bcl2
In DepthDetails ArticlePubMed