BDBM50372216 CHEMBL402731
SMILES CN(Cc1cc(Cl)ccc1C#N)C1CCNC1
InChI Key InChIKey=JRLQHFJOFRKAKS-UHFFFAOYSA-N
Data  3 IC50
  Tab Delimited (TSV)   2D SDfile   Computed 3D by Vconf -m prep SDfile
Find this compound or compounds like it in BindingDB:
Activity Spreadsheet -- Enzyme Inhibition Constant Data from BindingDB
Found 3 hits for monomerid = 50372216
TargetNitric oxide synthase, inducible(Homo sapiens (Human))
Adolor
Curated by ChEMBL
LigandPNGBDBM50372216(CHEMBL402731)
Affinity DataIC50:  1.20E+3nM. Assay description: Inhibition of human iNOS expressed in human DLD1 cells after 1 hr
In DepthDetails ArticlePubMed
TargetNitric oxide synthase, endothelial(Homo sapiens (Human))
Adolor
Curated by ChEMBL
LigandPNGBDBM50372216(CHEMBL402731)
Affinity DataIC50:  4.00E+3nM. Assay description: Inhibition of human eNOS expressed in insect SF9 cells after 1 hr
In DepthDetails ArticlePubMed
TargetNitric oxide synthase, brain(Homo sapiens (Human))
Adolor
Curated by ChEMBL
LigandPNGBDBM50372216(CHEMBL402731)
Affinity DataIC50:  1.20E+3nM. Assay description: Inhibition of human nNOS expressed in insect SF9 cells after 1 hr
In DepthDetails ArticlePubMed