BDBM50372406 CHEMBL441735
SMILES O=C(CCc1ccc(Oc2ccccc2)cc1)c1ncco1
InChI Key InChIKey=LLQSCQSWBWHWLL-UHFFFAOYSA-N
Data  1 KI  3 IC50
  Tab Delimited (TSV)   2D SDfile   Computed 3D by Vconf -m prep SDfile
Find this compound or compounds like it in BindingDB:
Activity Spreadsheet -- Enzyme Inhibition Constant Data from BindingDB
Found 4 hits for monomerid = 50372406
TargetFatty-acid amide hydrolase 1 [30-579](Rattus norvegicus (rat))
The Scripps Research Institute
Curated by ChEMBL
LigandPNGBDBM50372406(CHEMBL441735)
Affinity DataKi:  77nM. Assay description: Inhibition of rat recombinant FAAH expressed in Escherichia coli
In DepthDetails ArticlePubMed
TargetNeutral cholesterol ester hydrolase 1(Homo sapiens (Human))
The Scripps Research Institute
Curated by ChEMBL
LigandPNGBDBM50372406(CHEMBL441735)
Affinity DataIC50: >1.00E+5nM. Assay description: Inhibition of KIAA1363
In DepthDetails ArticlePubMed
TargetLiver carboxylesterase 1(Homo sapiens (Human))
The Scripps Research Institute
Curated by ChEMBL
LigandPNGBDBM50372406(CHEMBL441735)
Affinity DataIC50:  30nM. Assay description: Inhibition of TGH
In DepthDetails ArticlePubMed
TargetFatty-acid amide hydrolase 1 [30-579](Rattus norvegicus (rat))
The Scripps Research Institute
Curated by ChEMBL
LigandPNGBDBM50372406(CHEMBL441735)
Affinity DataIC50:  500nM. Assay description: Inhibition of rat recombinant FAAH expressed in Escherichia coli
In DepthDetails ArticlePubMed