BDBM50372505 CHEMBL401505
SMILES COc1cc(NS(=O)(=O)c2ccc(C)cc2N)c2nc(C)ccc2c1
InChI Key InChIKey=SAPWBNJQBATSRN-UHFFFAOYSA-N
Data  2 EC50
  Tab Delimited (TSV)   2D SDfile   Computed 3D by Vconf -m prep SDfile
Find this compound or compounds like it in BindingDB:
Activity Spreadsheet -- Enzyme Inhibition Constant Data from BindingDB
Found 2 hits for monomerid = 50372505
TargetNF-kappa-B inhibitor alpha(Homo sapiens (Human))
Columbia University
Curated by ChEMBL
LigandPNGBDBM50372505(CHEMBL401505)
Affinity DataEC50:  3.00E+3nM. Assay description: Induction of human IkappaBalpha stabilization in OCI-Ly3 cells assessed as ratio of green light emiting IkappaBalpha-fused luciferase expression to r...
In DepthDetails ArticlePubMed
TargetNF-kappa-B inhibitor alpha(Homo sapiens (Human))
Columbia University
Curated by ChEMBL
LigandPNGBDBM50372505(CHEMBL401505)
Affinity DataEC50:  9.40E+3nM. Assay description: Induction of human IkappaBalpha stabilization in OCI-Ly3 cells by green light emiting IkappaBalpha-fused luciferase reporter gene assay
In DepthDetails ArticlePubMed