BDBM50372959 CHEMBL402351
SMILES Fc1ccc(CC23CN(CCC2=Cc2c(C3)cnn2-c2ccc(F)cc2)S(=O)(=O)c2ccc(cc2)N2CCOCC2)cc1
InChI Key InChIKey=KUBBKRKMJZXCDL-UHFFFAOYSA-N
Data  2 KI
  Tab Delimited (TSV)   2D SDfile   Computed 3D by Vconf -m prep SDfile
Find this compound or compounds like it in BindingDB:
Activity Spreadsheet -- Enzyme Inhibition Constant Data from BindingDB
Found 2 hits for monomerid = 50372959
TargetGlucocorticoid receptor(Homo sapiens (Human))
Corcept Therapeutics
Curated by ChEMBL
LigandPNGBDBM50372959(CHEMBL402351)
Affinity DataKi:  1.30nM. Assay description: Displacement of [3H]dexamethasone from human recombinant GR
In DepthDetails ArticlePubMed
TargetGlucocorticoid receptor(Homo sapiens (Human))
Corcept Therapeutics
Curated by ChEMBL
LigandPNGBDBM50372959(CHEMBL402351)
Affinity DataKi:  11nM. Assay description: Antagonist activity at GR in SW1353/MMTV5 cells assessed as inhibition of dexamethasone-induced luciferase expression
In DepthDetails ArticlePubMed