BDBM50373076 CHEMBL158835
SMILES CSc1ccc(NC2=C(C(=O)NC2=O)c2ccc(cc2)[N+]([O-])=O)cc1
InChI Key InChIKey=CLDZMWNXQSYUGP-UHFFFAOYSA-N
Data  1 IC50
  Tab Delimited (TSV)   2D SDfile   Computed 3D by Vconf -m prep SDfile
Find this compound or compounds like it in BindingDB:
Activity Spreadsheet -- Enzyme Inhibition Constant Data from BindingDB
Found 1 hit for monomerid = 50373076
TargetGlycogen synthase kinase-3 beta(Homo sapiens (Human))
University Of Jordan
Curated by ChEMBL
LigandPNGBDBM50373076(CHEMBL158835)
Affinity DataIC50:  392nM. Assay description: Inhibition of recombinant GSK3-beta
In DepthDetails ArticlePubMed