BDBM50373168 C-5947495::CHEMBL261864
SMILES COc1ccc(Cl)cc1NC(=O)c1cc2c(C)nn(-c3ccccc3)c2s1
InChI Key InChIKey=ZCIVILXERWFWQF-UHFFFAOYSA-N
Data  1 EC50
  Tab Delimited (TSV)   2D SDfile   Computed 3D by Vconf -m prep SDfile
Find this compound or compounds like it in BindingDB:
Activity Spreadsheet -- Enzyme Inhibition Constant Data from BindingDB
Found 1 hit for monomerid = 50373168
Target2-5A-dependent ribonuclease(Homo sapiens (Human))
Lerner Research Institute
Curated by ChEMBL
LigandPNGBDBM50373168(C-5947495 | CHEMBL261864)
Affinity DataEC50:  4.80E+4nM. Assay description: Activation of human recombinant Rnase L assessed as cleavage of FRET RNA probe
In DepthDetails ArticlePubMed