BDBM50373192 CHEMBL405519::US10729710, Compound (I)
SMILES CCCN1CCC[C@@H]2Cc3c(C[C@@H]12)ccc(O)c3O
InChI Key InChIKey=HZPDHOOVQQYBJP-TZMCWYRMSA-N
Data  5 EC50
  Tab Delimited (TSV)   2D SDfile   Computed 3D by Vconf -m prep SDfile
Find this compound or compounds like it in BindingDB:
Activity Spreadsheet -- Enzyme Inhibition Constant Data from BindingDB
Found 5 hits for monomerid = 50373192
TargetD(1A) dopamine receptor(Homo sapiens (Human))
University Centre For Pharmacy
Curated by ChEMBL
LigandPNGBDBM50373192(CHEMBL405519 | US10729710, Compound (I))
Affinity DataEC50:  25nM. Assay description: Agonist activity at human recombinant dopamine D1 receptor expressed in CHO cells assessed as stimulation of cAMP production
In DepthDetails ArticlePubMed
TargetD(2) dopamine receptor(Homo sapiens (Human))
University Centre For Pharmacy
Curated by ChEMBL
LigandPNGBDBM50373192(CHEMBL405519 | US10729710, Compound (I))
Affinity DataEC50:  0.650nM. Assay description: Agonist activity at human dopamine D2 receptor expressed in CHO cells assessed as inhibition of forskolin-stimulated cAMP production
In DepthDetails ArticlePubMed
Target5-hydroxytryptamine receptor 2B(Mus musculus (Mouse))
H. Lundbeck
US Patent
LigandPNGBDBM50373192(CHEMBL405519 | US10729710, Compound (I))
Affinity DataEC50:  2.90E+3nM. Assay description: Evaluation of the agonist activity of compounds (I), (Ia) and (Ib) at the human 5-HT2B receptor was performed by Eurofins/Cerep (France) measuring th...
In DepthDetails US Patent
TargetD(2) dopamine receptor(Homo sapiens (Human))
University Centre For Pharmacy
Curated by ChEMBL
LigandPNGBDBM50373192(CHEMBL405519 | US10729710, Compound (I))
Affinity DataEC50:  1.30nM. Assay description: Dopamine D2 receptor agonism was measured using a calcium mobilization assay protocol developed by HD Biosciences (China). Briefly, HEK293/G15 cells ...
In DepthDetails US Patent
TargetD(1A) dopamine receptor(Homo sapiens (Human))
University Centre For Pharmacy
Curated by ChEMBL
LigandPNGBDBM50373192(CHEMBL405519 | US10729710, Compound (I))
Affinity DataEC50:  3.30nM. Assay description: Dopamine D1 receptor agonism was measured using a HTRF cAMP from CisBio using the protocol developed by HD Biosciences (China). Briefly, the assay is...
In DepthDetails US Patent