BDBM50373336 CHEMBL259138
SMILES CCCCCCc1ccc(Oc2ccncc2)c(O)c1
InChI Key InChIKey=YVUSUCCKZBSLJS-UHFFFAOYSA-N
Data  2 IC50
  Tab Delimited (TSV)   2D SDfile   Computed 3D by Vconf -m prep SDfile
Find this compound or compounds like it in BindingDB:
Activity Spreadsheet -- Enzyme Inhibition Constant Data from BindingDB
Found 2 hits for monomerid = 50373336
TargetEnoyl-[acyl-carrier-protein] reductase [NADH](Mycobacterium tuberculosis (strain ATCC 25618 / H3...)TBA
LigandPNGBDBM50373336(CHEMBL259138)
Affinity DataIC50:  6.25E+6nM. Assay description: Inhibition of Mycobacterium tuberculosis InhA
In DepthDetails Article
TargetEnoyl-[acyl-carrier-protein] reductase [NADH](Mycobacterium tuberculosis (strain ATCC 25618 / H3...)TBA
LigandPNGBDBM50373336(CHEMBL259138)
Affinity DataIC50:  160nM. Assay description: Inhibition of 100 nM Mycobacterium tuberculosis H37RV InhA
In DepthDetails ArticlePubMed