BDBM50373358 CHEMBL258199
SMILES Cc1cc(NC(=O)OC(C)(C)C)nn1Cc1cc(Cl)ccc1OCc1ccccc1
InChI Key InChIKey=WAPPDJVNPDRYEP-UHFFFAOYSA-N
Data  5 IC50  1 Kd
  Tab Delimited (TSV)   2D SDfile   Computed 3D by Vconf -m prep SDfile
Find this compound or compounds like it in BindingDB:
Activity Spreadsheet -- Enzyme Inhibition Constant Data from BindingDB
Found 6 hits for monomerid = 50373358
TargetCytochrome P450 2D6(Homo sapiens (Human))
Glaxosmithkline
Curated by ChEMBL
LigandPNGBDBM50373358(CHEMBL258199)
Affinity DataIC50: >1.00E+5nM. Assay description: Inhibition of CYP2D6
In DepthDetails ArticlePubMed
TargetCytochrome P450 1A2(Homo sapiens (Human))
Glaxosmithkline
Curated by ChEMBL
LigandPNGBDBM50373358(CHEMBL258199)
Affinity DataIC50: >1.00E+5nM. Assay description: Inhibition of CYP1A2
In DepthDetails ArticlePubMed
TargetProstaglandin E2 receptor EP1 subtype(Homo sapiens (Human))
Glaxosmithkline
Curated by ChEMBL
LigandPNGBDBM50373358(CHEMBL258199)
Affinity DataKd:  50.1nM. Assay description: Antagonist activity at PGE2-EP1 receptor assessed as PGE2-induced response by schild analysis
In DepthDetails ArticlePubMed
TargetCytochrome P450 2C9(Homo sapiens (Human))
Glaxosmithkline
Curated by ChEMBL
LigandPNGBDBM50373358(CHEMBL258199)
Affinity DataIC50:  1.60E+4nM. Assay description: Inhibition of CYP2C9
In DepthDetails ArticlePubMed
TargetCytochrome P450 3A4(Homo sapiens (Human))
Glaxosmithkline
Curated by ChEMBL
LigandPNGBDBM50373358(CHEMBL258199)
Affinity DataIC50: >1.00E+5nM. Assay description: Inhibition of CYP3A4
In DepthDetails ArticlePubMed
TargetCytochrome P450 2C19(Homo sapiens (Human))
Glaxosmithkline
Curated by ChEMBL
LigandPNGBDBM50373358(CHEMBL258199)
Affinity DataIC50: >1.00E+5nM. Assay description: Inhibition of CYP2C19
In DepthDetails ArticlePubMed