BDBM50373389 CHEMBL257130
SMILES CCN(CC)C(=O)[C@]1(C[C@H]1CN)c1cc2cc(F)ccc2s1
InChI Key InChIKey=JUESHDJIQYYBKK-SJCJKPOMSA-N
Data  3 IC50
  Tab Delimited (TSV)   2D SDfile   Computed 3D by Vconf -m prep SDfile
Find this compound or compounds like it in BindingDB:
Activity Spreadsheet -- Enzyme Inhibition Constant Data from BindingDB
Found 3 hits for monomerid = 50373389
TargetSodium-dependent noradrenaline transporter(Homo sapiens (Human))
Neurocrine Bioscience
Curated by ChEMBL
LigandPNGBDBM50373389(CHEMBL257130)
Affinity DataIC50:  150nM. Assay description: Inhibition of norepinephrine uptake at human NET expressed in HEK293 cells
In DepthDetails ArticlePubMed
TargetSodium-dependent dopamine transporter(Homo sapiens (Human))
Neurocrine Bioscience
Curated by ChEMBL
LigandPNGBDBM50373389(CHEMBL257130)
Affinity DataIC50: >1.00E+4nM. Assay description: Inhibition of dopamine uptake at human DAT expressed in HEK293 cells
In DepthDetails ArticlePubMed
TargetSodium-dependent serotonin transporter(Homo sapiens (Human))
Neurocrine Bioscience
Curated by ChEMBL
LigandPNGBDBM50373389(CHEMBL257130)
Affinity DataIC50:  290nM. Assay description: Inhibition of serotonin uptake at human SERT expressed in HEK293 cells
In DepthDetails ArticlePubMed