BDBM50373698 CHEMBL271398
SMILES C[C@@H]1O[C@@H](O[C@@H]2[C@@H](NC(C)=O)[C@H](O)O[C@H](CO)[C@H]2O[C@@H]2O[C@H](CO)[C@H](O)[C@H](O[C@@]3(C[C@H](O)[C@@H](NC(C)=O)[C@@H](O3)[C@H](O)[C@H](O)CO)C(O)=O)[C@H]2O)[C@@H](O)[C@H](O)[C@@H]1O
InChI Key InChIKey=NIGUVXFURDGQKZ-UQTBNESHSA-N
Data  1 IC50
  Tab Delimited (TSV)   2D SDfile   Computed 3D by Vconf -m prep SDfile
Find this compound or compounds like it in BindingDB:
Activity Spreadsheet -- Enzyme Inhibition Constant Data from BindingDB
Found 1 hit for monomerid = 50373698
TargetE-selectin(Homo sapiens (Human))
University Of Basel
Curated by ChEMBL
LigandPNGBDBM50373698(CHEMBL271398)
Affinity DataIC50:  1.00E+6nM. Assay description: Binding affinity to E-selectin
In DepthDetails ArticlePubMed