BDBM50373954 CHEMBL429422
SMILES CC(C)Cn1cnc2ccc(nc12)-c1nc([nH]c1-c1ccccc1)-c1c(Cl)cccc1Cl
InChI Key InChIKey=GHXSPUQNXBOUQJ-UHFFFAOYSA-N
Data  2 IC50
  Tab Delimited (TSV)   2D SDfile   Computed 3D by Vconf -m prep SDfile
Find this compound or compounds like it in BindingDB:
Activity Spreadsheet -- Enzyme Inhibition Constant Data from BindingDB
Found 2 hits for monomerid = 50373954
TargetMitogen-activated protein kinase 14(Mus musculus (mouse))
Eli Lilly
Curated by ChEMBL
LigandPNGBDBM50373954(CHEMBL429422)
Affinity DataIC50:  64.7nM. Assay description: Inhibition of mouse p38alpha in anisomycin-stimulated RAW 264.7 cells by ELISA
In DepthDetails ArticlePubMed
TargetMitogen-activated protein kinase 14(Homo sapiens (Human))
Eli Lilly
Curated by ChEMBL
LigandPNGBDBM50373954(CHEMBL429422)
Affinity DataIC50:  3.70nM. Assay description: Inhibition of human recombinant p38alpha
In DepthDetails ArticlePubMed